Spatial grid ontology
type: Ontology
version IRI: http://crossnature.eu/def/spatialgrid/1.0
creator: Tragsatec @es
description: This ontology specifies a terrestres geographical grid system available for the provision of spatial information for multipurposes uses.

hasTopConcept
type: ObjectProperty
inverse of: topConceptOf
domain: ConceptScheme
range: Concept
description: Relates, by convention, a concept scheme to a concept which is topmost in the broader/narrower concept hierarchies for that scheme, providing an entry point to these hierarchies.

areaKm
type: DatatypeProperty
domain: cell
range: long
comment: Superficie de la cuadrícula

cod100k
type: DatatypeProperty
domain: cell
range: string

Axiom
annotated source: cod100k
annotated property: comment
comment: Dígitos identificativos de la cuadrícula 100 x 100 km. (en la que está incluida la cuadrícula 10x10km)

cod100x100
type: DatatypeProperty
domain: cell
range: string
comment: CODIFICACIÓN Cuadrícula 100 x 100 km (en la que está incluida la cuadrícula 10x10km)

cod10x10
type: DatatypeProperty
domain: cell
range: string
comment: Código de la cuadrícula de 10 km de lado. Campo que sirve de enlace con la base de datos del IEET en una relación de 1 a M

codINB
type: DatatypeProperty
domain: cell
range: string
comment: Código de la antigua malla de 10 x 10 en el sistema ED50

codPos
type: DatatypeProperty
domain: cell
range: string

Axiom
annotated source: codPos
annotated property: comment
comment: Huso UTM (28 a 32, para Península/Baleares) seguido de la Zona (S y T, para Península/Baleares)

codUTM
type: DatatypeProperty
domain: cell
range: string
comment: Numeración de la cuadrícula 10x10km (dentro de la malla 100x100km correspondiente), formada por la combinación del campos COD100K y los valores X e Y

environment
type: DatatypeProperty
domain: cell
range: integer
comment: Indica si la cuadrícula es marina, terrestre o de otros países 0 - Terrestre 1 - Marino 2 - Otros países

perimKm
type: DatatypeProperty
domain: cell
range: long
comment: Perímetro de la cuadrícula

asGML
type: DatatypeProperty
sub property of: has serialization
domain: Geometry
domain: Class
  union of: cell
  union of: centroid
  union of: grid
range: gmlLiteral
contributor: Matthew Perry
creator: OGC GeoSPARQL 1.0 Standard Working Group
date: 2011-06-16
description: The GML serialization of a geometry

asWKT
type: DatatypeProperty
sub property of: has serialization
domain: Geometry
domain: Class
  union of: cell
  union of: centroid
  union of: grid
range: wktLiteral
contributor: Matthew Perry
creator: OGC GeoSPARQL 1.0 Standard Working Group
date: 2011-06-16
description: The WKT serialization of a geometry

has serialization
type: DatatypeProperty
domain: Geometry
range: Literal
contributor: Matthew Perry
creator: OGC GeoSPARQL 1.0 Standard Working Group
date: 2011-06-16
description: Connects a geometry object with its text-based serialization.

area
type: Class
description: area

disputed
type: Class
subclass of: territory
disjoint with: non self governing
disjoint with: other
disjoint with: self governing
description: disputed

non self governing
type: Class
subclass of: territory
disjoint with: other
disjoint with: self governing
source creator: UN Cartographic Section, Department of Field Support
source identifier: http://www.un.org/Depts/Cartographic/map/profile/world00.pdf
source modified: 2010-05-01
source: UN Cartographic Section, Department of Field Support http://www.un.org/Depts/Cartographic/map/profile/world00.pdf

other
type: Class
subclass of: territory
disjoint with: self governing
description: other

self governing
type: Class
subclass of: territory
source creator: United Nations Map Library
source identifier: http://www.un.org/depts/dhl/maplib/countinfo.htm
source modified: 2010-09-08
source: United Nations Map Library http://www.un.org/depts/dhl/maplib/countinfo.htm

territory
type: Class
subclass of: area
description: territory

cell
type: Class
subclass of: Geometry
subclass of: Restriction
  on property: asGML
  some values from: gmlLiteral
subclass of: Restriction
  on property: asWKT
  some values from: wktLiteral
description: The class represents the cells belonging to a grid.

centroid
type: Class
subclass of: Geometry
subclass of: Restriction
  on property: cod
  some values from: string
subclass of: Restriction
  on property: asWKT
  some values from: wktLiteral
description: The class represents the centroid belonging to a cell.

grid
type: Class
subclass of: Geometry
subclass of: Restriction
  on property: asWKT
  some values from: wktLiteral
description: The class represents a system of spatial grids

Geometry
type: Class
description: The class represents the top-level geometry type. This class is equivalent to the UML class GM_Object defined in ISO 19107, and it is superclass of all geometry types.

Concept
type: Class
description: A SKOS concept can be viewed as an idea or notion; a unit of thought. However, what constitutes a unit of thought is subjective, and this definition is meant to be suggestive, rather than restrictive. The notion of a SKOS concept is useful when describing the conceptual or intellectual structure of a knowledge organization system, and when referring to specific ideas or meanings established within a KOS.

ConceptScheme
type: Class
description: A SKOS concept scheme can be viewed as an aggregation of one or more SKOS concepts. Semantic relationships (links) between those concepts may also be viewed as part of a concept scheme. This definition is, however, meant to be suggestive rather than restrictive, and there is some flexibility in the formal data model stated below. The notion of a concept scheme is useful when dealing with data from an unknown source, and when dealing with data that describes two or more different knowledge organization systems.

Projection UTM ETRS89 zone 28N
type: NamedIndividual
type: Concept
top concept of: Coordinate Reference Systems

Coordinate Reference Systems
type: NamedIndividual
type: ConceptScheme
has top concept: ETRS89 ETRS LAEA
has top concept: Ellipsoidal Coordinates ETRS89 IDEE
has top concept: Geographic Coordinates ED50
has top concept: Geographic Coordinates WGS84
has top concept: Projection UTM ED50 Zone 28 N
has top concept: Projection UTM ED50 Zone 29 N
has top concept: Projection UTM ED50 Zone 30 N
has top concept: Projection UTM ED50 Zone 31 N
has top concept: Projection UTM ETRS89 zone 28N
has top concept: Projection UTM ETRS89 Zone 29 N
has top concept: Projection UTM ETRS89 Zone 30 N
has top concept: Projection UTM ETRS89 Zone 31 N
has top concept: Projection UTM WGS84 Zone 28 N
has top concept: Projection UTM WGS84 Zone 29 N
has top concept: Projection UTM WGS84 Zone 30 N
has top concept: Projection UTM WGS84 Zone 31 N

spatial reference system
type: NamedIndividual
type: ConceptScheme
has top concept: EPSG_23028
has top concept: EPSG_23029
has top concept: EPSG_23030
has top concept: EPSG_23031
has top concept: EPSG_25828
has top concept: EPSG_25829
has top concept: EPSG_25830
has top concept: EPSG_25831
has top concept: EPSG 3035
has top concept: EPSG_32628
has top concept: EPSG_32629
has top concept: EPSG_32630
has top concept: EPSG_32631
has top concept: EPSG 4230
has top concept: EPSG 4258
has top concept: EPSG 4326